Reaction Details
TargetCarbonic anhydrase 1
LigandBDBM50130742
Substrate/Competitorn/a
Meas. Tech.ChEMBL_1524847 (CHEMBL3636829)
Ki 7.1±n/a nM
Citation Ibrahim, HSAbou-Seri, SMTanc, MElaasser, MMAbdel-Aziz, HASupuran, CT Isatin-pyrazole benzenesulfonamide hybrids potently inhibit tumor-associated carbonic anhydrase isoforms IX and XII. Eur J Med Chem103:583-93 (2015) 
 
Carbonic anhydrase 1
Name:Carbonic anhydrase 1
Type:Enzyme
Mol. Mass.:28873.37
Organism:Homo sapiens (Human)
Description:P00915
Residue:261
BDBM50130742
NameBDBM50130742
Synonyms:CHEMBL3633552
TypeSmall organic molecule
Emp. Form.C19H17N7O5S
Mol. Mass.455.447
SMILESCOc1ccc2NC(=O)\C(=N/NC(=O)c3cnn(c3N)-c3ccc(cc3)S(N)(=O)=O)c2c1