Reaction Details
TargetCarbonic anhydrase 2
LigandBDBM50130746
Substrate/Competitorn/a
Meas. Tech.ChEMBL_1524848 (CHEMBL3636830)
Ki 5.5±n/a nM
Citation Ibrahim, HSAbou-Seri, SMTanc, MElaasser, MMAbdel-Aziz, HASupuran, CT Isatin-pyrazole benzenesulfonamide hybrids potently inhibit tumor-associated carbonic anhydrase isoforms IX and XII. Eur J Med Chem103:583-93 (2015) 
 
Carbonic anhydrase 2
Name:Carbonic anhydrase 2
Type:Enzyme
Mol. Mass.:29250.71
Organism:Homo sapiens (Human)
Description:P00918
Residue:260
BDBM50130746
NameBDBM50130746
Synonyms:CHEMBL3633385
TypeSmall organic molecule
Emp. Form.C24H17BrN6O4S
Mol. Mass.565.399
SMILESNS(=O)(=O)c1ccc(cc1)-n1ncc(C(=O)N\N=C2/C(=O)Nc3ccc(Br)cc23)c1-c1ccccc1