Reaction Details
TargetCarbonic anhydrase 2
LigandBDBM50130741
Substrate/Competitorn/a
Meas. Tech.ChEMBL_1524848 (CHEMBL3636830)
Ki 3.2±n/a nM
Citation Ibrahim, HSAbou-Seri, SMTanc, MElaasser, MMAbdel-Aziz, HASupuran, CT Isatin-pyrazole benzenesulfonamide hybrids potently inhibit tumor-associated carbonic anhydrase isoforms IX and XII. Eur J Med Chem103:583-93 (2015) 
 
Carbonic anhydrase 2
Name:Carbonic anhydrase 2
Type:Enzyme
Mol. Mass.:29250.71
Organism:Homo sapiens (Human)
Description:P00918
Residue:260
BDBM50130741
NameBDBM50130741
Synonyms:CHEMBL3633551
TypeSmall organic molecule
Emp. Form.C18H14BrN7O4S
Mol. Mass.504.317
SMILESNc1c(cnn1-c1ccc(cc1)S(N)(=O)=O)C(=O)N\N=C1/C(=O)Nc2ccc(Br)cc12