Reaction Details
TargetCarbonic anhydrase 2
LigandBDBM50130742
Substrate/Competitorn/a
Meas. Tech.ChEMBL_1524848 (CHEMBL3636830)
Ki 4.5±n/a nM
Citation Ibrahim, HSAbou-Seri, SMTanc, MElaasser, MMAbdel-Aziz, HASupuran, CT Isatin-pyrazole benzenesulfonamide hybrids potently inhibit tumor-associated carbonic anhydrase isoforms IX and XII. Eur J Med Chem103:583-93 (2015) 
 
Carbonic anhydrase 2
Name:Carbonic anhydrase 2
Type:Enzyme
Mol. Mass.:29250.71
Organism:Homo sapiens (Human)
Description:P00918
Residue:260
BDBM50130742
NameBDBM50130742
Synonyms:CHEMBL3633552
TypeSmall organic molecule
Emp. Form.C19H17N7O5S
Mol. Mass.455.447
SMILESCOc1ccc2NC(=O)\C(=N/NC(=O)c3cnn(c3N)-c3ccc(cc3)S(N)(=O)=O)c2c1