Reaction Details
TargetKappa-type opioid receptor
LigandBDBM50130756
Substrate/Competitorn/a
Meas. Tech.ChEMBL_1525032 (CHEMBL3637630)
Ki 0.350±n/a nM
Citation Molenveld, PBouzanne des Mazery, RSterk, GJStorcken, RPAutar, Rvan Oss, Bvan der Haas, RNFröhlich, RSchepmann, DWünsch, BSoeberdt, M Conformationally restricted¿-opioid receptor agonists: Synthesis and pharmacological evaluation of diastereoisomeric and enantiomeric decahydroquinoxalines. Bioorg Med Chem Lett25:5326-30 (2015) 
 
Kappa-type opioid receptor
Name:Kappa-type opioid receptor
Type:G Protein-Coupled Receptor (GPCR)
Mol. Mass.:42744.99
Organism:Cavia porcellus (domestic guinea pig)
Description:P41144
Residue:380
BDBM50130756
NameBDBM50130756
Synonyms:CHEMBL3634515
TypeSmall organic molecule
Emp. Form.C22H29Cl2N3O3
Mol. Mass.454.39
SMILES[H][C@@]12CCC[C@@H](N3CCCC3)[C@]1([H])N(CCN2C(=O)OC)C(=O)Cc1ccc(Cl)c(Cl)c1