Reaction Details
TargetMu-type opioid receptor
LigandBDBM50130756
Substrate/Competitorn/a
Meas. Tech.ChEMBL_1525033 (CHEMBL3637631)
Ki 113±n/a nM
Citation Molenveld, PBouzanne des Mazery, RSterk, GJStorcken, RPAutar, Rvan Oss, Bvan der Haas, RNFröhlich, RSchepmann, DWünsch, BSoeberdt, M Conformationally restricted¿-opioid receptor agonists: Synthesis and pharmacological evaluation of diastereoisomeric and enantiomeric decahydroquinoxalines. Bioorg Med Chem Lett25:5326-30 (2015) 
 
Mu-type opioid receptor
Name:Mu-type opioid receptor
Type:Enzyme Catalytic Domain
Mol. Mass.:11165.58
Organism:GUINEA PIG
Description:P97266
Residue:98
BDBM50130756
NameBDBM50130756
Synonyms:CHEMBL3634515
TypeSmall organic molecule
Emp. Form.C22H29Cl2N3O3
Mol. Mass.454.39
SMILES[H][C@@]12CCC[C@@H](N3CCCC3)[C@]1([H])N(CCN2C(=O)OC)C(=O)Cc1ccc(Cl)c(Cl)c1