Reaction Details
TargetKappa-type opioid receptor
LigandBDBM50000780
Substrate/Competitorn/a
Meas. Tech.ChEMBL_1525031 (CHEMBL3637629)
Ki 340±n/a nM
Citation Molenveld, PBouzanne des Mazery, RSterk, GJStorcken, RPAutar, Rvan Oss, Bvan der Haas, RNFröhlich, RSchepmann, DWünsch, BSoeberdt, M Conformationally restricted¿-opioid receptor agonists: Synthesis and pharmacological evaluation of diastereoisomeric and enantiomeric decahydroquinoxalines. Bioorg Med Chem Lett25:5326-30 (2015) 
 
Kappa-type opioid receptor
Name:Kappa-type opioid receptor
Type:G Protein-Coupled Receptor (GPCR)
Mol. Mass.:42648.76
Organism:Homo sapiens (Human)
Description:P41145
Residue:380
BDBM50000780
NameBDBM50000780
Synonyms:2-(3,4-Dichloro-phenyl)-N-methyl-N-(2-pyrrolidin-1-yl-cyclohexyl)-acetamide CHEMBL593781
TypeSmall organic molecule
Emp. Form.C19H26Cl2N2O
Mol. Mass.369.329
SMILESCN([C@H]1CCCC[C@@H]1N1CCCC1)C(=O)Cc1ccc(Cl)c(Cl)c1