Reaction Details
TargetCocaine esterase
LigandBDBM50130908
Substrate/Competitorn/a
Meas. Tech.ChEMBL_1525590 (CHEMBL3637216)
IC50 4630±n/a nM
Citation Mai, ZPZhou, KGe, GBWang, CHuo, XKDong, PPDeng, SZhang, BJZhang, HLHuang, SSMa, XC Protostane Triterpenoids from the Rhizome of Alisma orientale Exhibit Inhibitory Effects on Human Carboxylesterase 2. J Nat Prod78:2372-80 (2015) 
 
Cocaine esterase
Name:Cocaine esterase
Type:PROTEIN
Mol. Mass.:61801.08
Organism:Homo sapiens (Human)
Description:ChEMBL_1494240
Residue:559
BDBM50130908
NameBDBM50130908
Synonyms:CHEMBL3632954
TypeSmall organic molecule
Emp. Form.C30H50O4
Mol. Mass.474.7156
SMILES[H][C@@]12CC[C@@]3(C)[C@@]([H])(CCC4=C(CC[C@]34C)[C@H](C)C[C@H](O)[C@@H](O)C(C)(C)O)[C@@]1(C)CCC(=O)C2(C)C