Reaction Details
TargetCocaine esterase
LigandBDBM50130919
Substrate/Competitorn/a
Meas. Tech.ChEMBL_1525590 (CHEMBL3637216)
IC50 8680±n/a nM
Citation Mai, ZPZhou, KGe, GBWang, CHuo, XKDong, PPDeng, SZhang, BJZhang, HLHuang, SSMa, XC Protostane Triterpenoids from the Rhizome of Alisma orientale Exhibit Inhibitory Effects on Human Carboxylesterase 2. J Nat Prod78:2372-80 (2015) 
 
Cocaine esterase
Name:Cocaine esterase
Type:PROTEIN
Mol. Mass.:61801.08
Organism:Homo sapiens (Human)
Description:ChEMBL_1494240
Residue:559
BDBM50130919
NameBDBM50130919
Synonyms:CHEMBL3632942
TypeSmall organic molecule
Emp. Form.C30H44O4
Mol. Mass.468.668
SMILES[H][C@@]12CC[C@@]3(C)[C@@]([H])(C=CC4=C([C@H](C)C[C@H](O)[C@H](O)C(C)=C)C(=O)C[C@]34C)[C@@]1(C)CCC(=O)C2(C)C