Reaction Details
TargetCarbonic anhydrase 5B, mitochondrial
LigandBDBM50131679
Substrate/Competitorn/a
Meas. Tech.ChEMBL_1523554 (CHEMBL3631202)
Ki 620±n/a nM
Citation Maresca, AAkyuz, GOsman, SMAlOthman, ZSupuran, CT Inhibition of mammalian carbonic anhydrase isoforms I-XIV with a series of phenolic acid esters. Bioorg Med Chem23:7181-8 (2015) 
 
Carbonic anhydrase 5B, mitochondrial
Name:Carbonic anhydrase 5B, mitochondrial
Type:Enzyme
Mol. Mass.:36440.83
Organism:Homo sapiens (Human)
Description:Human (cloned) isozyme
Residue:317
BDBM50131679
NameBDBM50131679
Synonyms:CHEMBL3628211 | p-Hydroxyphenylethyl p-coumarate (17)
TypeSmall organic molecule
Emp. Form.C17H16O4
Mol. Mass.284.3065
SMILESOc1ccc(CCOC(=O)\C=C\c2ccc(O)cc2)cc1