Reaction Details
TargetCarbonic anhydrase 7
LigandBDBM50131682
Substrate/Competitorn/a
Meas. Tech.ChEMBL_1523556 (CHEMBL3631204)
Ki 820±n/a nM
Citation Maresca, AAkyuz, GOsman, SMAlOthman, ZSupuran, CT Inhibition of mammalian carbonic anhydrase isoforms I-XIV with a series of phenolic acid esters. Bioorg Med Chem23:7181-8 (2015) 
 
Carbonic anhydrase 7
Name:Carbonic anhydrase 7
Type:Enzyme
Mol. Mass.:29664.11
Organism:Homo sapiens (Human)
Description:Human cloned isozyme.
Residue:264
BDBM50131682
NameBDBM50131682
Synonyms:CHEMBL3628132
TypeSmall organic molecule
Emp. Form.C25H24O6
Mol. Mass.420.4545
SMILESOc1cccc(CCOc2cccc(CCOC(=O)\C=C\c3ccc(O)c(O)c3)c2)c1