Reaction Details
TargetCarbonic anhydrase 12
LigandBDBM50214744
Substrate/Competitorn/a
Meas. Tech.ChEMBL_1523558 (CHEMBL3631206)
Ki 9780±n/a nM
Citation Maresca, AAkyuz, GOsman, SMAlOthman, ZSupuran, CT Inhibition of mammalian carbonic anhydrase isoforms I-XIV with a series of phenolic acid esters. Bioorg Med Chem23:7181-8 (2015) 
 
Carbonic anhydrase 12
Name:Carbonic anhydrase 12
Type:Enzyme
Mol. Mass.:39456.00
Organism:Homo sapiens (Human)
Description:Catalytic domain of human cloned isozyme was used in the assay
Residue:354
BDBM50214744
NameBDBM50214744
Synonyms:(2E)-3-(4-hydroxy-3-methoxyphenyl)prop-2-enoic acid CHEMBL32749 ferulic acid
TypeSmall organic molecule
Emp. Form.C10H10O4
Mol. Mass.194.184
SMILESCOc1cc(\C=C\C(O)=O)ccc1O