Reaction Details
TargetCarbonic anhydrase 12
LigandBDBM4374
Substrate/Competitorn/a
Meas. Tech.ChEMBL_1523558 (CHEMBL3631206)
Ki 8010±n/a nM
Citation Maresca, AAkyuz, GOsman, SMAlOthman, ZSupuran, CT Inhibition of mammalian carbonic anhydrase isoforms I-XIV with a series of phenolic acid esters. Bioorg Med Chem23:7181-8 (2015) 
 
Carbonic anhydrase 12
Name:Carbonic anhydrase 12
Type:Enzyme
Mol. Mass.:39456.00
Organism:Homo sapiens (Human)
Description:Catalytic domain of human cloned isozyme was used in the assay
Residue:354
BDBM4374
NameBDBM4374
Synonyms:(2E)-3-(4-hydroxyphenyl)prop-2-enoic acid CHEMBL66879 p-Hydroxycinnamic acid (p-HCA) p-hydroxycinnamic acid (M4)
TypeSmall organic molecule
Emp. Form.C9H8O3
Mol. Mass.164.158
SMILESOC(=O)\C=C\c1ccc(O)cc1