Reaction Details
TargetCarbonic anhydrase 3
LigandBDBM50362850
Substrate/Competitorn/a
Meas. Tech.ChEMBL_1523551 (CHEMBL3631199)
Ki>50000±n/a nM
Citation Maresca, AAkyuz, GOsman, SMAlOthman, ZSupuran, CT Inhibition of mammalian carbonic anhydrase isoforms I-XIV with a series of phenolic acid esters. Bioorg Med Chem23:7181-8 (2015) 
 
Carbonic anhydrase 3
Name:Carbonic anhydrase 3
Type:Enzyme
Mol. Mass.:29562.11
Organism:Homo sapiens (Human)
Description:Human cloned isozyme.
Residue:260
BDBM50362850
NameBDBM50362850
Synonyms:CHEMBL1095574
TypeSmall organic molecule
Emp. Form.C16H14O3
Mol. Mass.254.2806
SMILESOc1ccc(\C=C\C(=O)OCc2ccccc2)cc1