Reaction Details
TargetCarbonic anhydrase 4
LigandBDBM50131682
Substrate/Competitorn/a
Meas. Tech.ChEMBL_1523552 (CHEMBL3631200)
Ki 33200±n/a nM
Citation Maresca, AAkyuz, GOsman, SMAlOthman, ZSupuran, CT Inhibition of mammalian carbonic anhydrase isoforms I-XIV with a series of phenolic acid esters. Bioorg Med Chem23:7181-8 (2015) 
 
Carbonic anhydrase 4
Name:Carbonic anhydrase 4
Type:Enzyme
Mol. Mass.:35037.98
Organism:Homo sapiens (Human)
Description:P22748
Residue:312
BDBM50131682
NameBDBM50131682
Synonyms:CHEMBL3628132
TypeSmall organic molecule
Emp. Form.C25H24O6
Mol. Mass.420.4545
SMILESOc1cccc(CCOc2cccc(CCOC(=O)\C=C\c3ccc(O)c(O)c3)c2)c1