Reaction Details
TargetCarbonic anhydrase 5A, mitochondrial
LigandBDBM50362850
Substrate/Competitorn/a
Meas. Tech.ChEMBL_1523553 (CHEMBL3631201)
Ki 970±n/a nM
Citation Maresca, AAkyuz, GOsman, SMAlOthman, ZSupuran, CT Inhibition of mammalian carbonic anhydrase isoforms I-XIV with a series of phenolic acid esters. Bioorg Med Chem23:7181-8 (2015) 
 
Carbonic anhydrase 5A, mitochondrial
Name:Carbonic anhydrase 5A, mitochondrial
Type:Enzyme
Mol. Mass.:34755.54
Organism:Homo sapiens (Human)
Description:Human (cloned) isozyme
Residue:305
BDBM50362850
NameBDBM50362850
Synonyms:CHEMBL1095574
TypeSmall organic molecule
Emp. Form.C16H14O3
Mol. Mass.254.2806
SMILESOc1ccc(\C=C\C(=O)OCc2ccccc2)cc1