Reaction Details
TargetHistone deacetylase 8
LigandBDBM50132484
Substrate/Competitorn/a
Meas. Tech.ChEMBL_1527405 (CHEMBL3636780)
IC50 5.2±n/a nM
Citation Peng, FWWu, TTRen, ZWXue, JYShi, L Hybrids from 4-anilinoquinazoline and hydroxamic acid as dual inhibitors of vascular endothelial growth factor receptor-2 and histone deacetylase. Bioorg Med Chem Lett25:5137-41 (2015) 
 
Histone deacetylase 8
Name:Histone deacetylase 8
Type:Enzyme
Mol. Mass.:41749.60
Organism:Homo sapiens (Human)
Description:Q9BY41
Residue:377
BDBM50132484
NameBDBM50132484
Synonyms:CHEMBL3633769
TypeSmall organic molecule
Emp. Form.C21H22Cl2N4O4
Mol. Mass.465.33
SMILESCOc1cc2ncnc(Nc3ccc(Cl)cc3Cl)c2cc1OCCCCCC(=O)NO