Reaction Details
TargetMetabotropic glutamate receptor 4
LigandBDBM50132712
Substrate/Competitorn/a
Meas. Tech.ChEMBL_1525066 (CHEMBL3635104)
EC50 647±n/a nM
Citation Garcia-Barrantes, PMCho, HPBlobaum, ALNiswender, CMConn, PJLindsley, CW Lead optimization of the VU0486321 series of mGlu1 PAMs. Part 1: SAR of modifications to the central aryl core. Bioorg Med Chem Lett25:5107-10 (2015) 
 
Metabotropic glutamate receptor 4
Name:Metabotropic glutamate receptor 4
Type:Protein
Mol. Mass.:101899.95
Organism:Homo sapiens (Human)
Description:Q14833
Residue:912
BDBM50132712
NameBDBM50132712
Synonyms:CHEMBL3632642
TypeSmall organic molecule
Emp. Form.C21H15ClN2O5
Mol. Mass.410.807
SMILESCOc1cc(NC(=O)c2occc2C)ccc1N1C(=O)c2cccc(Cl)c2C1=O