Reaction Details
Target5-hydroxytryptamine receptor 2A
LigandBDBM50133179
Substrate/Competitorn/a
Meas. Tech.ChEMBL_1525281 (CHEMBL3635890)
Ki 17±n/a nM
Citation Huang, LZhang, WZhang, XYin, LChen, BSong, J Synthesis and pharmacological evaluation of piperidine (piperazine)-substituted benzoxazole derivatives as multi-target antipsychotics. Bioorg Med Chem Lett25:5299-305 (2015) 
 
5-hydroxytryptamine receptor 2A
Name:5-hydroxytryptamine receptor 2A
Type:G Protein-Coupled Receptor (GPCR)
Mol. Mass.:52852.05
Organism:Rattus norvegicus (rat)
Description:Rat cortex membranes 5-HT2A receptors.
Residue:471
BDBM50133179
NameBDBM50133179
Synonyms:CHEMBL3634814
TypeSmall organic molecule
Emp. Form.C27H26N4O2S
Mol. Mass.470.586
SMILESC(COc1ccc(cc1)-c1nc2ccccc2o1)CN1CCN(CC1)c1nsc2ccccc12