Reaction Details
Target5-hydroxytryptamine receptor 2A
LigandBDBM50133181
Substrate/Competitorn/a
Meas. Tech.ChEMBL_1525281 (CHEMBL3635890)
Ki 8.3±n/a nM
Citation Huang, LZhang, WZhang, XYin, LChen, BSong, J Synthesis and pharmacological evaluation of piperidine (piperazine)-substituted benzoxazole derivatives as multi-target antipsychotics. Bioorg Med Chem Lett25:5299-305 (2015) 
 
5-hydroxytryptamine receptor 2A
Name:5-hydroxytryptamine receptor 2A
Type:G Protein-Coupled Receptor (GPCR)
Mol. Mass.:52852.05
Organism:Rattus norvegicus (rat)
Description:Rat cortex membranes 5-HT2A receptors.
Residue:471
BDBM50133181
NameBDBM50133181
Synonyms:CHEMBL3634813
TypeSmall organic molecule
Emp. Form.C28H26FN3O3
Mol. Mass.471.5227
SMILESFc1ccc2c(noc2c1)C1CCN(CCCOc2ccc(cc2)-c2nc3ccccc3o2)CC1