Reaction Details
TargetKappa-type opioid receptor
LigandBDBM50133218
Substrate/Competitorn/a
Meas. Tech.ChEMBL_1525468 (CHEMBL3636666)
Ki 160±n/a nM
Citation Joshi, AAMurray, TFAldrich, JV Structure-Activity Relationships of the Peptide Kappa Opioid Receptor Antagonist Zyklophin. J Med Chem58:8783-95 (2015) 
 
Kappa-type opioid receptor
Name:Kappa-type opioid receptor
Type:G Protein-Coupled Receptor (GPCR)
Mol. Mass.:42692.90
Organism:Rattus norvegicus (rat)
Description:P34975
Residue:380
BDBM50133218
NameBDBM50133218
Synonyms:CHEMBL3634918
TypeSmall organic molecule
Emp. Form.C59H93N23O13
Mol. Mass.1332.516
SMILESCN[C@@H](Cc1ccc(O)cc1)C(=O)NCC(=O)NCC(=O)N[C@@H](Cc1ccccc1)C(=O)N[C@@H]1CC(=O)NCC(NC(=O)[C@H](CCCNC(N)=N)NC(=O)[C@H](CCCNC(N)=N)NC1=O)C(=O)N[C@@H](CCCNC(N)=N)C(=O)N1CCC[C@H]1C(=O)N[C@@H](CCCCN)C(N)=O