Reaction Details
TargetKappa-type opioid receptor
LigandBDBM50133256
Substrate/Competitorn/a
Meas. Tech.ChEMBL_1525468 (CHEMBL3636666)
Ki 168±n/a nM
Citation Joshi, AAMurray, TFAldrich, JV Structure-Activity Relationships of the Peptide Kappa Opioid Receptor Antagonist Zyklophin. J Med Chem58:8783-95 (2015) 
 
Kappa-type opioid receptor
Name:Kappa-type opioid receptor
Type:G Protein-Coupled Receptor (GPCR)
Mol. Mass.:42692.90
Organism:Rattus norvegicus (rat)
Description:P34975
Residue:380
BDBM50133256
NameBDBM50133256
Synonyms:CHEMBL3632647
TypeSmall organic molecule
Emp. Form.C62H90N20O13
Mol. Mass.1323.5042
SMILESC[C@H](NC(=O)C1CNC(=O)C[C@@H](NC(=O)[C@H](Cc2ccccc2)NC(=O)CNC(=O)CNC(=O)[C@H](Cc2ccc(O)cc2)NCc2ccccc2)C(=O)N[C@@H](CCCNC(N)=N)C(=O)N[C@@H](CCCNC(N)=N)C(=O)N1)C(=O)N1CCC[C@H]1C(=O)N[C@@H](CCCCN)C(N)=O