Reaction Details
TargetSignal transducer and activator of transcription 3
LigandBDBM50133594
Substrate/Competitorn/a
Meas. Tech.ChEMBL_1525995 (CHEMBL3635931)
IC50 610000±n/a nM
Citation Abzianidze, VVProkofieva, DSChisty, LABolshakova, KPBerestetskiy, AOPanikorovskii, TLBogachenkov, ASHolder, AA Synthesis of natural phaeosphaeride A derivatives and an in vitro evaluation of their anti-cancer potential. Bioorg Med Chem Lett25:5566-9 (2015) 
 
Signal transducer and activator of transcription 3
Name:Signal transducer and activator of transcription 3
Type:Protein
Mol. Mass.:88064.31
Organism:Homo sapiens (Human)
Description:P40763
Residue:770
BDBM50133594
NameBDBM50133594
Synonyms:CHEMBL3632630
TypeSmall organic molecule
Emp. Form.C15H23NO5
Mol. Mass.297.3468
SMILESCCCCC[C@@H]1OC2=C([C@H](O)[C@@]1(C)O)C(=O)N(OC)C2=C