Reaction Details
TargetG-protein coupled receptor family C group 6 member A
LigandBDBM50133679
Substrate/Competitorn/a
Meas. Tech.ChEMBL_1526359 (CHEMBL3637420)
IC50 6166±n/a nM
Citation Johansson, HBoesgaard, MWNørskov-Lauritsen, LLarsen, IKuhne, SGloriam, DEBräuner-Osborne, HSejer Pedersen, D Selective Allosteric Antagonists for the G Protein-Coupled Receptor GPRC6A Based on the 2-Phenylindole Privileged Structure Scaffold. J Med Chem58:8938-51 (2015) 
 
G-protein coupled receptor family C group 6 member A
Name:G-protein coupled receptor family C group 6 member A
Type:PROTEIN
Mol. Mass.:104230.70
Organism:Mus musculus
Description:ChEMBL_109502
Residue:928
BDBM50133679
NameBDBM50133679
Synonyms:CHEMBL3633665
TypeSmall organic molecule
Emp. Form.C23H27N3O2
Mol. Mass.377.4794
SMILESCN(CCN1CCOCC1)CC(=O)c1c([nH]c2ccccc12)-c1ccccc1