Reaction Details
TargetExtracellular calcium-sensing receptor
LigandBDBM50133679
Substrate/Competitorn/a
Meas. Tech.ChEMBL_1526362 (CHEMBL3637423)
IC50 347000±n/a nM
Citation Johansson, HBoesgaard, MWNørskov-Lauritsen, LLarsen, IKuhne, SGloriam, DEBräuner-Osborne, HSejer Pedersen, D Selective Allosteric Antagonists for the G Protein-Coupled Receptor GPRC6A Based on the 2-Phenylindole Privileged Structure Scaffold. J Med Chem58:8938-51 (2015) 
 
Extracellular calcium-sensing receptor
Name:Extracellular calcium-sensing receptor
Type:PROTEIN
Mol. Mass.:120858.46
Organism:Rattus norvegicus
Description:ChEMBL_750426
Residue:1079
BDBM50133679
NameBDBM50133679
Synonyms:CHEMBL3633665
TypeSmall organic molecule
Emp. Form.C23H27N3O2
Mol. Mass.377.4794
SMILESCN(CCN1CCOCC1)CC(=O)c1c([nH]c2ccccc12)-c1ccccc1