Reaction Details
TargetMuscarinic acetylcholine receptor M3
LigandBDBM50133682
Substrate/Competitorn/a
Meas. Tech.ChEMBL_1526363 (CHEMBL3637424)
IC50 57500±n/a nM
Citation Johansson, HBoesgaard, MWNørskov-Lauritsen, LLarsen, IKuhne, SGloriam, DEBräuner-Osborne, HSejer Pedersen, D Selective Allosteric Antagonists for the G Protein-Coupled Receptor GPRC6A Based on the 2-Phenylindole Privileged Structure Scaffold. J Med Chem58:8938-51 (2015) 
 
Muscarinic acetylcholine receptor M3
Name:Muscarinic acetylcholine receptor M3
Type:Enzyme
Mol. Mass.:66151.03
Organism:Homo sapiens (Human)
Description:P20309
Residue:590
BDBM50133682
NameBDBM50133682
Synonyms:CHEMBL3633656
TypeSmall organic molecule
Emp. Form.C24H27N3O4
Mol. Mass.421.4889
SMILESCOc1ccc(cc1)-c1[nH]c2ccccc2c1C(=O)CN(C)CC(=O)N1CCOCC1