Reaction Details
TargetKappa-type opioid receptor
LigandBDBM50133885
Substrate/Competitorn/a
Meas. Tech.ChEMBL_1526690 (CHEMBL3636125)
Ki 8.4±n/a nM
Citation Harland, AAYeomans, LGriggs, NWAnand, JPPogozheva, IDJutkiewicz, EMTraynor, JRMosberg, HI Further Optimization and Evaluation of Bioavailable, Mixed-Efficacyµ-Opioid Receptor (MOR) Agonists/d-Opioid Receptor (DOR) Antagonists: Balancing MOR and DOR Affinities. J Med Chem58:8952-69 (2015) 
 
Kappa-type opioid receptor
Name:Kappa-type opioid receptor
Type:G Protein-Coupled Receptor (GPCR)
Mol. Mass.:42648.76
Organism:Homo sapiens (Human)
Description:P41145
Residue:380
BDBM50133885
NameBDBM50133885
Synonyms:CHEMBL3634250
TypeSmall organic molecule
Emp. Form.C29H39N3O3
Mol. Mass.477.6383
SMILESCC(=O)N1CC[C@@H](NC(=O)[C@@H](N)Cc2c(C)cc(O)cc2C)c2cc(CC3CCCCC3)ccc12