Reaction Details
TargetDelta-type opioid receptor
LigandBDBM50133886
Substrate/Competitorn/a
Meas. Tech.ChEMBL_1526572 (CHEMBL3635648)
Ki 3.4±n/a nM
Citation Harland, AAYeomans, LGriggs, NWAnand, JPPogozheva, IDJutkiewicz, EMTraynor, JRMosberg, HI Further Optimization and Evaluation of Bioavailable, Mixed-Efficacyµ-Opioid Receptor (MOR) Agonists/d-Opioid Receptor (DOR) Antagonists: Balancing MOR and DOR Affinities. J Med Chem58:8952-69 (2015) 
 
Delta-type opioid receptor
Name:Delta-type opioid receptor
Type:G Protein-Coupled Receptor (GPCR)
Mol. Mass.:40465.04
Organism:Rattus norvegicus (rat)
Description:Competition binding assays were using CHO-K1 cell membranes expressing the opioid receptor.
Residue:372
BDBM50133886
NameBDBM50133886
Synonyms:CHEMBL3634249
TypeSmall organic molecule
Emp. Form.C27H37N3O2
Mol. Mass.435.6016
SMILESCc1cc(O)cc(C)c1C[C@H](N)C(=O)N[C@@H]1CCNc2ccc(CC3CCCCC3)cc12