Reaction Details
TargetDelta-type opioid receptor
LigandBDBM50133888
Substrate/Competitorn/a
Meas. Tech.ChEMBL_1526572 (CHEMBL3635648)
Ki 1.8±n/a nM
Citation Harland, AAYeomans, LGriggs, NWAnand, JPPogozheva, IDJutkiewicz, EMTraynor, JRMosberg, HI Further Optimization and Evaluation of Bioavailable, Mixed-Efficacyµ-Opioid Receptor (MOR) Agonists/d-Opioid Receptor (DOR) Antagonists: Balancing MOR and DOR Affinities. J Med Chem58:8952-69 (2015) 
 
Delta-type opioid receptor
Name:Delta-type opioid receptor
Type:G Protein-Coupled Receptor (GPCR)
Mol. Mass.:40465.04
Organism:Rattus norvegicus (rat)
Description:Competition binding assays were using CHO-K1 cell membranes expressing the opioid receptor.
Residue:372
BDBM50133888
NameBDBM50133888
Synonyms:CHEMBL3634247
TypeSmall organic molecule
Emp. Form.C29H33N3O3
Mol. Mass.471.5906
SMILESCC(=O)N1CC[C@@H](NC(=O)[C@@H](N)Cc2c(C)cc(O)cc2C)c2cc(Cc3ccccc3)ccc12