Reaction Details
TargetReceptor tyrosine-protein kinase erbB-2
LigandBDBM50134241
Substrate/Competitorn/a
Meas. Tech.ChEMBL_1543610 (CHEMBL3750871)
IC50 3530±n/a nM
Citation Tao, XXDuan, YTChen, LWTang, DJYang, MRWang, PFXu, CZhu, HL Design, synthesis and biological evaluation of pyrazolyl-nitroimidazole derivatives as potential EGFR/HER-2 kinase inhibitors. Bioorg Med Chem Lett26:677-83 (2016) 
 
Receptor tyrosine-protein kinase erbB-2
Name:Receptor tyrosine-protein kinase erbB-2
Type:n/a
Mol. Mass.:137894.47
Organism:Homo sapiens (Human)
Description:P04626
Residue:1255
BDBM50134241
NameBDBM50134241
Synonyms:CHEMBL3746642
TypeSmall organic molecule
Emp. Form.C25H24N6O7
Mol. Mass.520.4941
SMILESCC(Cn1c(C)ncc1[N+]([O-])=O)OC(=O)c1ccc(cc1)C1CC(=NN1C(C)=O)c1ccc(cc1)[N+]([O-])=O