Reaction Details
TargetEpidermal growth factor receptor
LigandBDBM50134236
Substrate/Competitorn/a
Meas. Tech.ChEMBL_1543611 (CHEMBL3750872)
IC50 601±n/a nM
Citation Tao, XXDuan, YTChen, LWTang, DJYang, MRWang, PFXu, CZhu, HL Design, synthesis and biological evaluation of pyrazolyl-nitroimidazole derivatives as potential EGFR/HER-2 kinase inhibitors. Bioorg Med Chem Lett26:677-83 (2016) 
 
Epidermal growth factor receptor
Name:Epidermal growth factor receptor
Type:Receptor Kinase Domain
Mol. Mass.:134279.59
Organism:Homo sapiens (Human)
Description:P00533
Residue:1210
BDBM50134236
NameBDBM50134236
Synonyms:CHEMBL3746473
TypeSmall organic molecule
Emp. Form.C24H22N6O7
Mol. Mass.506.4675
SMILESCC(=O)N1N=C(CC1c1ccc(cc1)C(=O)OCCn1c(C)ncc1[N+]([O-])=O)c1ccc(cc1)[N+]([O-])=O