Reaction Details
TargetcAMP-specific 3',5'-cyclic phosphodiesterase 4B
LigandBDBM50134434
Substrate/Competitorn/a
Meas. Tech.ChEMBL_1544649 (CHEMBL3750622)
IC50 0.030000±n/a nM
Citation Le Roux, JLeriche, CChamiot-Clerc, PFeutrill, JHalley, FPapin, DDerimay, NMugler, CGrépin, CSchio, L Preparation and optimization of pyrazolo[1,5-a]pyrimidines as new potent PDE4 inhibitors. Bioorg Med Chem Lett26:454-9 (2016) 
 
cAMP-specific 3',5'-cyclic phosphodiesterase 4B
Name:cAMP-specific 3',5'-cyclic phosphodiesterase 4B
Type:Protein
Mol. Mass.:83318.87
Organism:Homo sapiens (Human)
Description:Q07343
Residue:736
BDBM50134434
NameBDBM50134434
Synonyms:CHEMBL3746046
TypeSmall organic molecule
Emp. Form.C17H15Cl2N5O3S
Mol. Mass.440.304
SMILESCc1c(nn2c(Nc3cc(Cl)cc(Cl)c3)c3C(=O)NCCc3nc12)S(C)(=O)=O