Reaction Details
TargetTyrosine-protein kinase Fgr
LigandBDBM50136226
Substrate/Competitorn/a
Meas. Tech.ChEMBL_1547358 (CHEMBL3757135)
IC50 65±n/a nM
Citation Yoon, HKwak, YChoi, SCho, HKim, NDSim, T A Pyrazolo[3,4-d]pyrimidin-4-amine Derivative Containing an Isoxazole Moiety Is a Selective and Potent Inhibitor of RET Gatekeeper Mutants. J Med Chem59:358-73 (2016) 
 
Tyrosine-protein kinase Fgr
Name:Tyrosine-protein kinase Fgr
Type:protein
Mol. Mass.:59469.88
Organism:Homo sapiens (Human)
Description:P09769
Residue:529
BDBM50136226
NameBDBM50136226
Synonyms:CHEMBL3753341
TypeSmall organic molecule
Emp. Form.C14H16N6O
Mol. Mass.284.3164
SMILESCC(C)n1nc(-c2cc(on2)C2CC2)c2c(N)ncnc12