Reaction Details
TargetDual specificity mitogen-activated protein kinase kinase 2
LigandBDBM50136226
Substrate/Competitorn/a
Meas. Tech.ChEMBL_1547357 (CHEMBL3757134)
IC50 82±n/a nM
Citation Yoon, HKwak, YChoi, SCho, HKim, NDSim, T A Pyrazolo[3,4-d]pyrimidin-4-amine Derivative Containing an Isoxazole Moiety Is a Selective and Potent Inhibitor of RET Gatekeeper Mutants. J Med Chem59:358-73 (2016) 
 
Dual specificity mitogen-activated protein kinase kinase 2
Name:Dual specificity mitogen-activated protein kinase kinase 2
Type:Enzyme Catalytic Domain
Mol. Mass.:44423.61
Organism:Homo sapiens (Human)
Description:gi_13489054
Residue:400
BDBM50136226
NameBDBM50136226
Synonyms:CHEMBL3753341
TypeSmall organic molecule
Emp. Form.C14H16N6O
Mol. Mass.284.3164
SMILESCC(C)n1nc(-c2cc(on2)C2CC2)c2c(N)ncnc12