Reaction Details
TargetDihydrofolate reductase
LigandBDBM50049905
Substrate/Competitorn/a
Meas. Tech.ChEMBL_1539066 (CHEMBL3738282)
Ki 0.000±n/a nM
Citation Chao, BLi, BXXiao, X The chemistry and pharmacology of privileged pyrroloquinazolines. Medchemcomm6:510-520 (2015) Dihydrofolate reductase
Name:Dihydrofolate reductase
Type:Enzyme
Mol. Mass.:21453.99
Organism:Homo sapiens (Human)
Description:Recombinant human DHFR.
Residue:187
BDBM50049905
NameBDBM50049905
Synonyms:7-(1-Ethyl-propyl)-8-methyl-7H-pyrrolo[3,2-f]quinazoline-1,3-diamine TCMDC-137283
TypeSmall organic molecule
Emp. Form.C16H21N5
Mol. Mass.283.3714
SMILESCCC(CC)n1c(C)cc2c1ccc1nc(N)nc(N)c21