Reaction Details
TargetEphrin type-B receptor 3
LigandBDBM50134791
Substrate/Competitorn/a
Meas. Tech.ChEMBL_1539535 (CHEMBL3738311)
IC50 3900±n/a nM
Citation Castelli, RTognolini, MVacondio, FIncerti, MPala, DCallegari, DBertoni, SGiorgio, CHassan-Mohamed, IZanotti, IBugatti, ARusnati, MFestuccia, CRivara, SBarocelli, EMor, MLodola, A ¿(5)-Cholenoyl-amino acids as selective and orally available antagonists of the Eph-ephrin system. Eur J Med Chem103:312-24 (2015) 
 
Ephrin type-B receptor 3
Name:Ephrin type-B receptor 3
Type:Protein
Mol. Mass.:110326.17
Organism:Homo sapiens (Human)
Description:P54753
Residue:998
BDBM50134791
NameBDBM50134791
Synonyms:CHEMBL3734863
TypeSmall organic molecule
Emp. Form.C35H48N2O4
Mol. Mass.560.7666
SMILES[H][C@@]1(CC[C@@]2([H])[C@]3([H])CC=C4C[C@@H](O)CC[C@]4(C)[C@@]3([H])CC[C@]12C)[C@H](C)CCC(=O)N[C@@H](Cc1c[nH]c2ccccc12)C(O)=O