Reaction Details
TargetDual specificity mitogen-activated protein kinase kinase 1
LigandBDBM50134938
Substrate/Competitorn/a
Meas. Tech.ChEMBL_1544506 (CHEMBL3750088)
IC50 15±n/a nM
Citation Hartung, IVHammer, SHitchcock, MNeuhaus, RScholz, ASiemeister, GBohlmann, RHillig, RCPühler, F Optimization of allosteric MEK inhibitors. Part 2: Taming the sulfamide group balances compound distribution properties. Bioorg Med Chem Lett26:186-93 (2015) 
 
Dual specificity mitogen-activated protein kinase kinase 1
Name:Dual specificity mitogen-activated protein kinase kinase 1
Type:Other Protein Type
Mol. Mass.:43439.03
Organism:Homo sapiens (Human)
Description:Full-length human MEK-1 was generated by PCR and purified as a fusion protein from Escherichia coli lysates.
Residue:393
BDBM50134938
NameBDBM50134938
Synonyms:CHEMBL3747256
TypeSmall organic molecule
Emp. Form.C20H17F2IN4O4S
Mol. Mass.574.34
SMILESCc1c(NS(N)(=O)=O)cccc1Oc1cc(F)cc(Nc2ccc(I)cc2F)c1C(N)=O