Reaction Details
TargetDual specificity mitogen-activated protein kinase kinase 1
LigandBDBM50134970
Substrate/Competitorn/a
Meas. Tech.ChEMBL_1544506 (CHEMBL3750088)
IC50 83±n/a nM
Citation Hartung, IVHammer, SHitchcock, MNeuhaus, RScholz, ASiemeister, GBohlmann, RHillig, RCPühler, F Optimization of allosteric MEK inhibitors. Part 2: Taming the sulfamide group balances compound distribution properties. Bioorg Med Chem Lett26:186-93 (2015) 
 
Dual specificity mitogen-activated protein kinase kinase 1
Name:Dual specificity mitogen-activated protein kinase kinase 1
Type:Other Protein Type
Mol. Mass.:43439.03
Organism:Homo sapiens (Human)
Description:Full-length human MEK-1 was generated by PCR and purified as a fusion protein from Escherichia coli lysates.
Residue:393
BDBM50134970
NameBDBM50134970
Synonyms:CHEMBL3747516
TypeSmall organic molecule
Emp. Form.C21H19F2IN4O4S
Mol. Mass.588.366
SMILESCC(NS(N)(=O)=O)c1cccc(Oc2cc(F)cc(Nc3ccc(I)cc3F)c2C(N)=O)c1