Reaction Details
TargetCarbonic anhydrase 2
LigandBDBM50134968
Substrate/Competitorn/a
Meas. Tech.ChEMBL_1544509 (CHEMBL3750091)
IC50>10000±n/a nM
Citation Hartung, IVHammer, SHitchcock, MNeuhaus, RScholz, ASiemeister, GBohlmann, RHillig, RCPühler, F Optimization of allosteric MEK inhibitors. Part 2: Taming the sulfamide group balances compound distribution properties. Bioorg Med Chem Lett26:186-93 (2015) 
 
Carbonic anhydrase 2
Name:Carbonic anhydrase 2
Type:Enzyme
Mol. Mass.:29250.71
Organism:Homo sapiens (Human)
Description:P00918
Residue:260
BDBM50134968
NameBDBM50134968
Synonyms:CHEMBL3746569
TypeSmall organic molecule
Emp. Form.C21H19F2IN4O4S
Mol. Mass.588.366
SMILESNCCS(=O)(=O)Nc1cccc(Oc2cc(F)cc(Nc3ccc(I)cc3F)c2C(N)=O)c1