Reaction Details
TargetSeed linoleate 13S-lipoxygenase-1
LigandBDBM50135284
Substrate/Competitorn/a
Meas. Tech.ChEMBL_1546118 (CHEMBL3749636)
IC50 1000±n/a nM
Citation Averina, EBVasilenko, DAGracheva, YAGrishin, YKRadchenko, EVBurmistrov, VVButov, GMNeganova, MESerkova, TPRedkozubova, OMShevtsova, EFMilaeva, ERKuznetsova, TSZefirov, NS Synthesis and biological evaluation of novel 5-hydroxylaminoisoxazole derivatives as lipoxygenase inhibitors and metabolism enhancing agents. Bioorg Med Chem24:712-20 (2016) 
 
Seed linoleate 13S-lipoxygenase-1
Name:Seed linoleate 13S-lipoxygenase-1
Type:Enzyme
Mol. Mass.:94365.66
Organism:Glycine max (soybean)
Description:n/a
Residue:839
BDBM50135284
NameBDBM50135284
Synonyms:CHEMBL3746105
TypeSmall organic molecule
Emp. Form.C20H28N2O5
Mol. Mass.376.4467
SMILESCC12CC3CC(C)(C1)CC(C3)(C2)OC(=O)c1cc(on1)N(O)C1CCCO1