Reaction Details
TargetAromatase
LigandBDBM50421878
Substrate/Competitorn/a
Meas. Tech.ChEMBL_1547124 (CHEMBL3755859)
Ki 2.5±n/a nM
Citation Yadav, MRBarmade, MATamboli, RSMurumkar, PR Developing steroidal aromatase inhibitors-an effective armament to win the battle against breast cancer. Eur J Med Chem105:1-38 (2015) 
 
Aromatase
Name:Aromatase
Type:Enzyme
Mol. Mass.:57888.92
Organism:Homo sapiens (Human)
Description:P11511
Residue:503
BDBM50421878
NameBDBM50421878
Synonyms:CHEMBL2311178
TypeSmall organic molecule
Emp. Form.C19H22O2
Mol. Mass.282.3768
SMILESC[C@]12CC[C@H]3[C@@H](C=CC4=CC(=O)C=C[C@]34C)[C@@H]1CCC2=O