Reaction Details
TargetAromatase
LigandBDBM50136071
Substrate/Competitorn/a
Meas. Tech.ChEMBL_1547308 (CHEMBL3756944)
Ki 1.000000±n/a nM
Citation Yadav, MRBarmade, MATamboli, RSMurumkar, PR Developing steroidal aromatase inhibitors-an effective armament to win the battle against breast cancer. Eur J Med Chem105:1-38 (2015) 
 
Aromatase
Name:Aromatase
Type:Enzyme
Mol. Mass.:57888.92
Organism:Homo sapiens (Human)
Description:P11511
Residue:503
BDBM50136071
NameBDBM50136071
Synonyms:CHEMBL3753593
TypeSmall organic molecule
Emp. Form.C20H26O3
Mol. Mass.314.4186
SMILES[H][C@]1(CO1)[C@]12CCC(=O)C=C1CC[C@@]1([H])[C@]3([H])CCC(=O)[C@@]3(C)CC[C@]21[H]