Reaction Details
TargetAromatase
LigandBDBM50136075
Substrate/Competitorn/a
Meas. Tech.ChEMBL_1547308 (CHEMBL3756944)
Ki 3.4±n/a nM
Citation Yadav, MRBarmade, MATamboli, RSMurumkar, PR Developing steroidal aromatase inhibitors-an effective armament to win the battle against breast cancer. Eur J Med Chem105:1-38 (2015) 
 
Aromatase
Name:Aromatase
Type:Enzyme
Mol. Mass.:57888.92
Organism:Homo sapiens (Human)
Description:P11511
Residue:503
BDBM50136075
NameBDBM50136075
Synonyms:CHEMBL3754519
TypeSmall organic molecule
Emp. Form.C20H29NO2
Mol. Mass.315.4498
SMILES[H][C@]1(CN1)[C@]12CCC(=O)C=C1CC[C@@]1([H])[C@]3([H])CC[C@H](O)[C@@]3(C)CC[C@]21[H]