Reaction Details
TargetTelomeric repeat-binding factor 2-interacting protein 1
LigandBDBM50136305
Substrate/Competitorn/a
Meas. Tech.ChEMBL_1547629 (CHEMBL3755499)
IC50 700±n/a nM
Citation Ran, XLiu, LYang, CYLu, JChen, YLei, MWang, S Design of High-Affinity Stapled Peptides To Target the Repressor Activator Protein 1 (RAP1)/Telomeric Repeat-Binding Factor 2 (TRF2) Protein-Protein Interaction in the Shelterin Complex. J Med Chem59:328-34 (2016) 
 
Telomeric repeat-binding factor 2-interacting protein 1
Name:Telomeric repeat-binding factor 2-interacting protein 1
Type:PROTEIN
Mol. Mass.:44229.72
Organism:Homo sapiens (Human)
Description:ChEMBL_116704
Residue:399
BDBM50136305
NameBDBM50136305
Synonyms:CHEMBL3752828
TypeSmall organic molecule
Emp. Form.C82H138N22O21S2
Mol. Mass.1832.238
SMILESCCC(C)C(NC(=O)C(NC(=O)C(NC(C)=O)C(C)O)C(C)O)C(=O)NCC(=O)NC(CCSC)C(=O)NC(CCSC)C(=O)NC(C(C)O)C(=O)NC(CC(C)C)C(=O)NC(CCCCN)C(=O)NC1CCCCn2cc(CC(NC(=O)C(CCCCN)NC(=O)C(Cc3ccccc3)NC(=O)C(C)NC1=O)C(=O)NC(CC(C)C)C(=O)NC(CO)C(N)=O)nn2