Reaction Details
TargetTelomeric repeat-binding factor 2-interacting protein 1
LigandBDBM50136306
Substrate/Competitorn/a
Meas. Tech.ChEMBL_1547629 (CHEMBL3755499)
IC50 36500±n/a nM
Citation Ran, XLiu, LYang, CYLu, JChen, YLei, MWang, S Design of High-Affinity Stapled Peptides To Target the Repressor Activator Protein 1 (RAP1)/Telomeric Repeat-Binding Factor 2 (TRF2) Protein-Protein Interaction in the Shelterin Complex. J Med Chem59:328-34 (2016) 
 
Telomeric repeat-binding factor 2-interacting protein 1
Name:Telomeric repeat-binding factor 2-interacting protein 1
Type:PROTEIN
Mol. Mass.:44229.72
Organism:Homo sapiens (Human)
Description:ChEMBL_116704
Residue:399
BDBM50136306
NameBDBM50136306
Synonyms:CHEMBL3754019
TypeSmall organic molecule
Emp. Form.C81H136N22O22S
Mol. Mass.1802.146
SMILES[H][C@]1(NC(=O)[C@H](CCCCn2cc(C[C@H](NC(=O)[C@H](CCCCN)NC(=O)[C@H](CC(C)C)NC1=O)C(=O)N[C@@H](C)C(=O)N[C@@H](Cc1ccccc1)C(=O)N[C@@H](CCCCN)C(=O)N[C@@H]([C@@H](C)O)C(=O)N[C@@H](CC(C)C)C(=O)N[C@@H](CO)C(N)=O)nn2)NC(=O)[C@H](CCSC)NC(=O)CNC(=O)[C@@H](NC(=O)[C@@H](NC(=O)[C@@H](NC(C)=O)[C@@H](C)O)[C@@H](C)O)[C@@H](C)CC)[C@@H](C)O