Reaction Details
TargetTelomeric repeat-binding factor 2-interacting protein 1
LigandBDBM50136303
Substrate/Competitorn/a
Meas. Tech.ChEMBL_1547629 (CHEMBL3755499)
IC50 182000±n/a nM
Citation Ran, XLiu, LYang, CYLu, JChen, YLei, MWang, S Design of High-Affinity Stapled Peptides To Target the Repressor Activator Protein 1 (RAP1)/Telomeric Repeat-Binding Factor 2 (TRF2) Protein-Protein Interaction in the Shelterin Complex. J Med Chem59:328-34 (2016) 
 
Telomeric repeat-binding factor 2-interacting protein 1
Name:Telomeric repeat-binding factor 2-interacting protein 1
Type:PROTEIN
Mol. Mass.:44229.72
Organism:Homo sapiens (Human)
Description:ChEMBL_116704
Residue:399
BDBM50136303
NameBDBM50136303
Synonyms:CHEMBL3752934
TypeSmall organic molecule
Emp. Form.C68H119N17O16S
Mol. Mass.1462.842
SMILESCC[C@H](C)[C@H](NC(C)=O)C(=O)NCC(=O)N[C@@H](CCSC)C(=O)N[C@@H](CCCCN)C(=O)N[C@@H]([C@@H](C)O)C(=O)N[C@@H](CC(C)C)C(=O)N[C@@H](CCCCN)C(=O)N[C@@H](C)C(=O)N[C@@H](C)C(=O)N[C@@H](Cc1ccccc1)C(=O)N[C@@H](CCCCN)C(=O)N[C@@H]([C@@H](C)O)C(=O)N[C@@H](CC(C)C)C(N)=O