Reaction Details
TargetPoly [ADP-ribose] polymerase tankyrase-1/tankyrase-2
LigandBDBM50136757
Substrate/Competitorn/a
Meas. Tech.ChEMBL_1548572 (CHEMBL3757229)
IC50 790±n/a nM
Citation Haikarainen, TWaaler, JIgnatev, ANkizinkiko, YVenkannagari, HObaji, EKrauss, SLehtiö, L Development and structural analysis of adenosine site binding tankyrase inhibitors. Bioorg Med Chem Lett26:328-33 (2016) 
 
Poly [ADP-ribose] polymerase tankyrase-1/tankyrase-2
Name:Poly [ADP-ribose] polymerase tankyrase-1/tankyrase-2
Synonyms:Tankyrase 1/2
Type:n/a
Mol. Mass.:n/a
Description:ASSAY_ID of ChEMBL is 1985233
Components:This complex has 2 components.
Component 1
Name:Poly [ADP-ribose] polymerase tankyrase-2
Type:Enzyme
Mol. Mass.:126937.16
Organism:Homo sapiens (Human)
Description:Q9H2K2
Residue:1166
Component 2
Name:Poly [ADP-ribose] polymerase tankyrase-1
Synonyms:(ARTD5 or PARP5a) PARPL Poly [ADP-ribose] polymerase tankyrase-1 TINF1 TNKS1 Tankyrase 1 Tankyrase-1 Tankyrase-1 (TNKS1)
Type:Enzyme
Mol. Mass.:142058.03
Organism:Homo sapiens (Human)
Description:O95271
Residue:1327
BDBM50136757
NameBDBM50136757
Synonyms:CHEMBL3753510
TypeSmall organic molecule
Emp. Form.C28H29ClN2O5
Mol. Mass.508.993
SMILESCOc1ccc(cc1)C(=O)Nc1ccc(C(=O)NCC2(CCOCC2)c2ccc(OC)cc2)c(Cl)c1