Reaction Details
TargetProtein mono-ADP-ribosyltransferase PARP4
LigandBDBM50136772
Substrate/Competitorn/a
Meas. Tech.ChEMBL_1548584 (CHEMBL3757403)
IC50>100000±n/a nM
Citation Haikarainen, TWaaler, JIgnatev, ANkizinkiko, YVenkannagari, HObaji, EKrauss, SLehtiö, L Development and structural analysis of adenosine site binding tankyrase inhibitors. Bioorg Med Chem Lett26:328-33 (2016) 
 
Protein mono-ADP-ribosyltransferase PARP4
Name:Protein mono-ADP-ribosyltransferase PARP4
Type:n/a
Mol. Mass.:192563.23
Organism:Homo sapiens (Human)
Description:Q9UKK3
Residue:1724
BDBM50136772
NameBDBM50136772
Synonyms:CHEMBL3752492
TypeSmall organic molecule
Emp. Form.C25H19ClN4O3
Mol. Mass.458.896
SMILESCOc1ccc(cc1)C(=O)Nc1ccc(cc1)C(=O)N(c1ccncn1)c1ccccc1Cl