Reaction Details
TargetProstaglandin E2 receptor EP1 subtype
LigandBDBM50138054
Substrate/Competitorn/a
Meas. Tech.ChEMBL_1549764 (CHEMBL3757320)
Ki 8418±n/a nM
Citation Kinoshita, AHigashino, MAratani, YKakuuchi, AMatsuya, HOhmoto, K Discovery of highly potent dual EP(2) and EP(3) agonists with subtype selectivity. Bioorg Med Chem Lett26:1016-9 (2016) 
 
Prostaglandin E2 receptor EP1 subtype
Name:Prostaglandin E2 receptor EP1 subtype
Type:Enzyme
Mol. Mass.:41834.57
Organism:Homo sapiens (Human)
Description:P34995
Residue:402
BDBM50138054
NameBDBM50138054
Synonyms:CHEMBL3753898
TypeSmall organic molecule
Emp. Form.C20H28N2O6S2
Mol. Mass.456.576
SMILESCCOCCC1(CCC1)[C@H](O)\C=C\[C@H]1COC(=O)N1CCSc1nc(cs1)C(O)=O