Reaction Details
TargetHistamine H3 receptor
LigandBDBM50138107
Substrate/Competitorn/a
Meas. Tech.ChEMBL_1549942 (CHEMBL3755089)
Ki 7.3±n/a nM
Citation Nirogi, RShinde, ATiriveedhi, VKota, LSaraf, SKBadange, RKMohammed, ARSubramanian, RMuddana, NBhyrapuneni, GAbraham, R Benzamide derivatives and their constrained analogs as histamine H3 receptor antagonists. Eur J Med Chem108:655-62 (2016) 
 
Histamine H3 receptor
Name:Histamine H3 receptor
Type:G Protein-Coupled Receptor (GPCR)
Mol. Mass.:48691.47
Organism:Homo sapiens (Human)
Description:Binding assays were using CHO cells stably expressing hH3R receptors.
Residue:445
BDBM50138107
NameBDBM50138107
Synonyms:CHEMBL3753304
TypeSmall organic molecule
Emp. Form.C23H34FN3O2
Mol. Mass.403.5334
SMILESCC(C)N1CCC(CC1)Oc1ccc(cc1F)C(=O)NC1CCN(C1)C1CCC1